{"text_format":"3","workbook":"xlsx","n_sheets":2,"sheets":["汇总","明细"],"not_rendered":{"external_links":1,"defined_names":1},"read":"whole","date_system":"1900"}

{"sheet":"汇总","index":0,"n_rows":14,"n_cols":12,"rows_kept":14,"merged":[[0,0,0,11]]}
["临河区2025年收益分红项目汇总表"]
["序号","乡镇 农场","受益总户数","受益总人口数","家庭人口数","脱贫户数","脱贫人口数","家庭人口数","监测户数","监测人口数","家庭人口数","补贴资金"]
[1,"新华镇",{"$f":"F3+I3","v":27},{"$f":"G3+J3","v":33},{"$f":"H3+K3","v":43},21,25,33,6,8,10,{"$f":"D3*2600","v":85800}]
[2,"乌兰图克镇",84,98,143,60,70,106,24,28,37,254800]
[3,"狼山镇",46,52,79,34,36,59,12,16,20,135200]
[4,"白脑包镇",71,84,144,36,38,73,35,46,71,218400]
[5,"干召庙镇",56,73,93,23,30,35,33,43,58,189800]
[6,"城关镇",19,26,34,16,21,25,3,5,9,67600]
[7,"双河镇",50,64,90,23,27,41,27,37,49,166400]
[8,"八一乡",41,58,81,15,20,24,26,38,57,150800]
[9,"曙光乡",26,42,48,1,1,1,25,41,47,109200]
[10,"临河农场",18,26,31,15,22,27,3,4,4,67600]
[11,"狼山农场",4,4,9,4,4,9,0,0,0,10400]
["合计",null,{"$f":"SUM(C3:C13)","v":442},560,795,248,294,433,194,266,362,1456000]

{"sheet":"明细","index":1,"n_rows":563,"n_cols":8,"rows_kept":563,"merged":[[0,0,0,7]]}
["临河区2025年收益分红人员名单"]
["序号","乡镇","行政村","村民小组","受益人姓名","分红资金（元）","劳动技能","人员类别（示例：监测户/脱贫户）"]
[1,"八一乡","章嘉庙村","一组","郝茂生",2600,"丧失劳动力","边缘易致贫户"]
[2,"八一乡","章嘉庙村","六组","达贞彤",2600,"无劳动力","边缘易致贫户"]
[3,"八一乡","章嘉庙村","六组","达贞君",2600,"无劳动力","边缘易致贫户"]
[4,"八一乡","章嘉庙村","四组","惠昌军",2600,"弱劳动力或半劳动力","脱贫户"]
[5,"八一乡","章嘉庙村","四组","惠常彪",2600,"弱劳动力或半劳动力","脱贫户"]
[6,"八一乡","联丰村六组","六组","安芝花",2600,"无劳动力","脱贫户"]
[7,"八一乡","农丰村","三组","王忠明",2600,"丧失劳动力","脱贫户"]
[8,"八一乡","联丰村","六组","张利",2600,"丧失劳动力","突发严重困难户"]
[9,"八一乡","联丰村","六组","张美英",2600,"弱劳动力或半劳动力","突发严重困难户"]
[10,"八一乡","联丰村","六组","崔振保",2600,"无劳动力","突发严重困难户"]
[11,"八一乡","农丰村","三组","王桃花",2600,"无劳动力","脱贫户"]
[12,"八一乡","农丰村","四组","周润萍",2600,"无劳动力","脱贫户"]
[13,"八一乡","农丰村","四组","王东亮",2600,"丧失劳动力","脱贫户"]
[14,"八一乡","农丰村","一组","李少蕾",2600,"丧失劳动力","突发严重困难户"]
[15,"八一乡","农丰村","四组","关占福",2600,"弱劳动力或半劳动力","突发严重困难户"]
[16,"八一乡","农丰村","四组","牛喜华",2600,"弱劳动力或半劳动力","突发严重困难户"]
[17,"八一乡","农丰村","四组","关悦称心",2600,"无劳动力","突发严重困难户"]
[18,"八一乡","农丰村","一组","王建明",2600,"无劳动力","突发严重困难户"]
[19,"八一乡","农丰村","一组","付建国",2600,"无劳动力","突发严重困难户"]
[20,"八一乡","农丰村","三组","王光明",2600,"丧失劳动力","突发严重困难户"]
[21,"八一乡","八一村","三组","王金金",2600,"弱劳动力或半劳动力","脱贫户"]
[22,"八一乡","八一村","四组","郭凤",2600,"无劳动力","脱贫户"]
[23,"八一乡","八一村","一组","陶在龙",2600,"无劳动力","边缘易致贫户"]
[24,"八一乡","八一村","一组","田桂香",2600,"弱劳动力或半劳动力","边缘易致贫户"]
[25,"八一乡","新道村","四组","刘外信",2600,"无劳动力","脱贫户"]
[26,"八一乡","新道村","四组","刘玉洪",2600,"弱劳动力或半劳动力","脱贫户"]
[27,"八一乡","新道村","五组","康文银",2600,"弱劳动力或半劳动力","脱贫户"]
[28,"八一乡","新道村","三组","康牛",2600,"无劳动力","边缘易致贫户"]
[29,"八一乡","新道村","三组","杨玉珍",2600,"无劳动力","边缘易致贫户"]
[30,"八一乡","新道村","四组","温支梅",2600,"无劳动力","突发严重困难户"]
[31,"八一乡","新道村","四组","刘凤英",2600,"无劳动力","突发严重困难户"]
[32,"八一乡","新道村","一组","高凤其",2600,"无劳动力","边缘易致贫户"]
[33,"八一乡","新道村","一组","张秀英",2600,"无劳动力","边缘易致贫户"]
[34,"八一乡","新道村","一组","张金凤",2600,"丧失劳动力","边缘易致贫户"]
[35,"八一乡","新道村","一组","曹文清",2600,"弱劳动力或半劳动力","突发严重困难户"]
[36,"八一乡","新道村","四组","王凤英",2600,"弱劳动力或半劳动力","突发严重困难户"]
[37,"八一乡","新道村","五组","朱新香",2600,"丧失劳动力","突发严重困难户"]
[38,"八一乡","星光村","八组","杨秀兰",2600,"无劳动力","突发严重困难户"]
[39,"八一乡","星光村","十组","孙红梅",2600,"丧失劳动力","突发严重困难户"]
[40,"八一乡","星光村","十组","赵博元",2600,"无劳动力","突发严重困难户"]
[41,"八一乡","星光村","五组","齐景山",2600,"丧失劳动力","突发严重困难户"]
[42,"八一乡","星光村","十二组","陈翠转",2600,"丧失劳动力","突发严重困难户"]
[43,"八一乡","星光村","八组","李建飞",2600,"丧失劳动力","突发严重困难户"]
[44,"八一乡","星光村","八组","魏桂桃",2600,"丧失劳动力","突发严重困难户"]
[45,"八一乡","星光村","八组","李宇博",2600,"无劳动力","脱贫户"]
[46,"八一乡","星光村","十二组","康五女",2600,"无劳动力","脱贫户"]
[47,"八一乡","星光村","八组","王三女",2600,"无劳动力","脱贫户"]
[48,"八一乡","星光村","八组","李林青",2600,"弱劳动力或半劳动力","脱贫户"]
[49,"八一乡","星光村","八组","张志英",2600,"无劳动力","脱贫户"]
[50,"八一乡","星光村","四组","张军",2600,"丧失劳动力","脱贫户"]
[51,"八一乡","星光村","六组","王大有",2600,"无劳动力","脱贫户"]
[52,"八一乡","星光村","五组","王来才",2600,"弱劳动力或半劳动力","脱贫户"]
[53,"八一乡","星光村","五组","闫翠莲",2600,"弱劳动力或半劳动力","脱贫户"]
[54,"八一乡","生丰村","七组","张慧",2600,"弱劳动力或半劳动力","边缘易致贫户"]
[55,"八一乡","生丰村","七组","吴宇航",2600,"无劳动力","边缘易致贫户"]
[56,"八一乡","生丰村","七组","吴梓航",2600,"无劳动力","边缘易致贫户"]
[57,"八一乡","长丰村","二组","李金龙",2600,"弱劳动力或半劳动力","突发严重困难户"]
[58,"八一乡","红星村","一组","张涛",2600,"弱劳动力或半劳动力","边缘易致贫户"]
[59,"白脑包镇","忠义村","二组","李哲瀚",2600,"无劳动力","脱贫户"]
[60,"白脑包镇","永清村","三组","范建忠",2600,"弱劳动力或半劳动力","突发严重困难户"]
[61,"白脑包镇","永清村","三组","温会枝",2600,"丧失劳动力","突发严重困难户"]
[62,"白脑包镇","永清村","七组","田思雅",2600,"无劳动力","脱贫户"]
[63,"白脑包镇","永清村","五组","刘和平",2600,"弱劳动力或半劳动力","突发严重困难户"]
[64,"白脑包镇","永清村","六组","段晓宇",2600,"无劳动力","脱贫户"]
[65,"白脑包镇","永清村","一组","刘占其",2600,"无劳动力","突发严重困难户"]
[66,"白脑包镇","永清村","四组","张浦田",2600,"无劳动力","脱贫户"]
[67,"白脑包镇","永清村","五组","郭建东",2600,"丧失劳动力","突发严重困难户"]
[68,"白脑包镇","永和村","二组","高秀兰",2600,"无劳动力","脱贫户"]
[69,"白脑包镇","永和村","三组","陈占中",2600,"弱劳动力或半劳动力","脱贫户"]
[70,"白脑包镇","永和村","五组","朱付明",2600,"弱劳动力或半劳动力","脱贫户"]
[71,"白脑包镇","永和村","六组","王再梅",2600,"弱劳动力或半劳动力","脱贫户"]
[72,"白脑包镇","永和村","一组","李登国",2600,"无劳动力","突发严重困难户"]
[73,"白脑包镇","永和村","七组","张玉秀",2600,"弱劳动力或半劳动力","脱贫户"]
[74,"白脑包镇","永胜村","八组","潘玉柱",2600,"无劳动力","脱贫户"]
[75,"白脑包镇","永胜村","十组","陈明明",2600,"弱劳动力或半劳动力","脱贫户"]
[76,"白脑包镇","永胜村","八组","杨翠兰",2600,"丧失劳动力","突发严重困难户"]
[77,"白脑包镇","永胜村","十组","郝在在",2600,"弱劳动力或半劳动力","脱贫户"]
[78,"白脑包镇","水桐树村","七组","李秀莲",2600,"无劳动力","脱贫户"]
[79,"白脑包镇","水桐树村","八组","张传平",2600,"无劳动力","脱贫户"]
[80,"白脑包镇","水桐树村","九组","杜旺小",2600,"无劳动力","突发严重困难户"]
[81,"白脑包镇","水桐树村","九组","肖兰子",2600,"无劳动力","突发严重困难户"]
[82,"白脑包镇","水桐树村","一组","任玉秀",2600,"无劳动力","突发严重困难户"]
[83,"白脑包镇","水桐树村","三组","王万才",2600,"无劳动力","脱贫户"]
[84,"白脑包镇","水桐树村","六组","雷凤飞",2600,"弱劳动力或半劳动力","脱贫户"]
[85,"白脑包镇","水桐树村","九组","王新荣",2600,"弱劳动力或半劳动力","边缘易致贫户"]
[86,"白脑包镇","水桐树村","一组","王梅兰",2600,"无劳动力","脱贫户"]
[87,"白脑包镇","西海村","三组","李学林",2600,"弱劳动力或半劳动力","突发严重困难户"]
[88,"白脑包镇","西海村","三组","吕秀玲",2600,"无劳动力","突发严重困难户"]
[89,"白脑包镇","西海村","七组","尚国娥",2600,"弱劳动力或半劳动力","脱贫户"]
[90,"白脑包镇","西海村","三组","柴桂花",2600,"弱劳动力或半劳动力","脱贫户"]
[91,"白脑包镇","太阳村","二组","张国元",2600,"无劳动力","脱贫户"]
[92,"白脑包镇","太阳村","六组","李建军",2600,"丧失劳动力","脱贫户"]
[93,"白脑包镇","太阳村","十三组","杨小女",2600,"无劳动力","脱贫户"]
[94,"白脑包镇","太阳村","十组","詹根喜",2600,"无劳动力","突发严重困难户"]
[95,"白脑包镇","胜利村","三组","李锁",2600,"无劳动力","突发严重困难户"]
[96,"白脑包镇","胜利村","三组","杨秀英",2600,"无劳动力","突发严重困难户"]
[97,"白脑包镇","胜利村","四组","陈美云",2600,"丧失劳动力","边缘易致贫户"]
[98,"白脑包镇","胜利村","四组","邱雅红",2600,"丧失劳动力","边缘易致贫户"]
[99,"白脑包镇","胜利村","四组","陈沛妮",2600,"无劳动力","边缘易致贫户"]
[100,"白脑包镇","春光村","一组","敖树全",2600,"丧失劳动力","突发严重困难户"]
[101,"白脑包镇","春光村","一组","敖悦",2600,"无劳动力","突发严重困难户"]
[102,"白脑包镇","春光村","三组","刘永林",2600,"弱劳动力或半劳动力","脱贫户"]
[103,"白脑包镇","联丰村","七组","池春凤",2600,"弱劳动力或半劳动力","突发严重困难户"]
[104,"白脑包镇","中心村","三组","唐永金",2600,"弱劳动力或半劳动力","脱贫户"]
[105,"白脑包镇","中心村","四组","朱高英",2600,"丧失劳动力","突发严重困难户"]
[106,"白脑包镇","中心村","六组","秦涛",2600,"丧失劳动力","脱贫户"]
[107,"白脑包镇","中心村","二组","付叶风",2600,"无劳动力","脱贫户"]
[108,"白脑包镇","中心村","一组","王翠英",2600,"无劳动力","突发严重困难户"]
[109,"白脑包镇","中心村","四组","李何",2600,"无劳动力","突发严重困难户"]
[110,"白脑包镇","中心村","四组","张守菊",2600,"无劳动力","突发严重困难户"]
[111,"白脑包镇","中心村","五组","祁浩源",2600,"无劳动力","突发严重困难户"]
[112,"白脑包镇","福利村","六组","左志成",2600,"无劳动力","边缘易致贫户"]
[113,"白脑包镇","福利村","六组","张兰英",2600,"无劳动力","边缘易致贫户"]
[114,"白脑包镇","胜利村","四组","王凤英",2600,"无劳动力","边缘易致贫户"]
[115,"白脑包镇","召滩村","二组","王建强",2600,"弱劳动力或半劳动力","边缘易致贫户"]
[116,"白脑包镇","世城西村","四组","杨玉凤",2600,"弱劳动力或半劳动力","脱贫户"]
[117,"白脑包镇","鞋工厂村","二组","侯孟瑶",2600,"无劳动力","边缘易致贫户"]
[118,"白脑包镇","鞋工厂村","一组","肖承学",2600,"无劳动力","脱贫户"]
[119,"白脑包镇","鞋工厂村","二组","赵明亮",2600,"弱劳动力或半劳动力","脱贫户"]
[120,"白脑包镇","鞋工厂村","二组","赵粉连",2600,"无劳动力","突发严重困难户"]
[121,"白脑包镇","十大股村","三组","陈星宇",2600,"丧失劳动力","突发严重困难户"]
[122,"白脑包镇","十大股村","三组","崔建光",2600,"丧失劳动力","突发严重困难户"]
[123,"白脑包镇","十大股村","一组","李化文",2600,"无劳动力","突发严重困难户"]
[124,"白脑包镇","十大股村","三组","黄仁荣",2600,"弱劳动力或半劳动力","突发严重困难户"]
[125,"白脑包镇","团结村","九组","徐富贵",2600,"丧失劳动力","边缘易致贫户"]
[126,"白脑包镇","民富村","三组","田平",2600,"无劳动力","突发严重困难户"]
[127,"白脑包镇","民富村","六组","孙海军",2600,"无劳动力","突发严重困难户"]
[128,"白脑包镇","召滩村","二组","王德荣",2600,"弱劳动力或半劳动力",{"$f":"VLOOKUP(E130,[1]基础信息表!$F:$AP,37,FALSE)","v":"脱贫户"}]
[129,"白脑包镇","太阳村","十二组","杜元玲",2600,"弱劳动力或半劳动力","突发严重困难户"]
[130,"白脑包镇","太阳村","十组","邬娥女",2600,"无劳动力","突发严重困难户"]
[131,"白脑包镇","太阳村","六组","窦珍秀",2600,"无劳动力",{"$f":"VLOOKUP(E133,[1]基础信息表!$F:$AP,37,FALSE)","v":"脱贫户"}]
[132,"白脑包镇","太阳村","四组","雷玉珍",2600,"弱劳动力或半劳动力",{"$f":"VLOOKUP(E134,[1]基础信息表!$F:$AP,37,FALSE)","v":"脱贫户"}]
[133,"白脑包镇","太阳村","四组","樊鸿畅",2600,"无劳动力",{"$f":"VLOOKUP(E135,[1]基础信息表!$F:$AP,37,FALSE)","v":"脱贫户"}]
[134,"白脑包镇","西海村","五组","刘引弟",2600,"无劳动力",{"$f":"VLOOKUP(E136,[1]基础信息表!$F:$AP,37,FALSE)","v":"脱贫户"}]
[135,"白脑包镇","明星村","二组","付弋",2600,"无劳动力",{"$f":"VLOOKUP(E137,[1]基础信息表!$F:$AP,37,FALSE)","v":"脱贫户"}]
[136,"白脑包镇","明星村","三组","杨大毛",2600,"无劳动力",{"$f":"VLOOKUP(E138,[1]基础信息表!$F:$AP,37,FALSE)","v":"脱贫户"}]
[137,"白脑包镇","明星村","六组","懂有贵",2600,"弱劳动力或半劳动力",{"$f":"VLOOKUP(E139,[1]基础信息表!$F:$AP,37,FALSE)","v":"脱贫户"}]
[138,"白脑包镇","明星村","六组","王素兰",2600,"弱劳动力或半劳动力",{"$f":"VLOOKUP(E140,[1]基础信息表!$F:$AP,37,FALSE)","v":"脱贫户"}]
[139,"白脑包镇","团结村","七组","屈建明",2600,"无劳动力","突发严重困难户"]
[140,"白脑包镇","团结村","七组","李魁先",2600,"无劳动力","突发严重困难户"]
[141,"白脑包镇","公产村","二组","关庆成",2600,"无劳动力","突发严重困难户"]
[142,"白脑包镇","公产村","二组","任玉珍",2600,"无劳动力","突发严重困难户"]
[143,"城关镇","远景村","五组","闫锁柱",2600,"无劳动力","脱贫户"]
[144,"城关镇","远景村","七组","武强",2600,"丧失劳动力","脱贫户"]
[145,"城关镇","远景村","六组","赵双",2600,"无劳动力","脱贫户"]
[146,"城关镇","远景村","八组","代希平",2600,"无劳动力","边缘易致贫户"]
[147,"城关镇","远景村","八组","崔银娥",2600,"无劳动力","边缘易致贫户"]
[148,"城关镇","友谊村","四组","张占彪",2600,"无劳动力","脱贫户"]
[149,"城关镇","友谊村","四组","张赫",2600,"无劳动力","脱贫户"]
[150,"城关镇","友谊村","二组","李元元",2600,"弱劳动力或半劳动力","脱贫户"]
[151,"城关镇","友谊村","二组","汪静",2600,"无劳动力","脱贫户"]
[152,"城关镇","友谊村","二组","李岩峰",2600,"无劳动力","脱贫户"]
[153,"城关镇","蓿亥村","十一组","王治国",2600,"无劳动力","脱贫户"]
[154,"城关镇","蓿亥村","十一组","杨培富",2600,"弱劳动力或半劳动力","脱贫户"]
[155,"城关镇","蓿亥村","三组","单学峰",2600,"弱劳动力或半劳动力","脱贫户"]
[156,"城关镇","蓿亥村","六组","于福清",2600,"弱劳动力或半劳动力","脱贫户"]
[157,"城关镇","蓿亥村","六组","郝桂梅",2600,"弱劳动力或半劳动力","脱贫户"]
[158,"城关镇","五四村","五组","王桂花",2600,"弱劳动力或半劳动力","脱贫户"]
[159,"城关镇","五四村","二组","郝世倡",2600,"弱劳动力或半劳动力","脱贫户"]
[160,"城关镇","继光村","一组","张梅芳",2600,"无劳动力","脱贫户"]
[161,"城关镇","继光村","一组","孔秀花",2600,"弱劳动力或半劳动力","脱贫户"]
[162,"城关镇","继光村","九组","马桂芳",2600,"无劳动力","脱贫户"]
[163,"城关镇","蓿亥村","十组","王国元",2600,"弱劳动力或半劳动力","脱贫户"]
[164,"城关镇","蓿亥村","十组","丁凤兰",2600,"\n无劳动力","脱贫户"]
[165,"城关镇","远景村","七组","孙玉梅",2600,"无劳动力","脱贫户"]
[166,"城关镇","蓿亥村","八组","赵守志",2600,"无劳动力","边缘易致贫户"]
[167,"城关镇","蓿亥村","八组","张玉凤",2600,"无劳动力","边缘易致贫户"]
[168,"城关镇","增光村","七组","哈风连",2600,"弱劳动力或半劳动力","边缘易致贫户"]
[169,"干召庙镇","永丰村","十二组","孙云德",2600,"弱劳动力或半劳动力","脱贫户"]
[170,"干召庙镇","永丰村","十二组","王玉梅",2600,"弱劳动力或半劳动力","脱贫户"]
[171,"干召庙镇","新利村","一组","闫子亮",2600,"无劳动力","突发严重困难户"]
[172,"干召庙镇","新利村","一组","边志文",2600,"无劳动力","突发严重困难户"]
[173,"干召庙镇","新利村","十组","高志中",2600,"无劳动力","脱贫不稳定户"]
[174,"干召庙镇","新利村","十组","张玉增",2600,"无劳动力","脱贫不稳定户"]
[175,"干召庙镇","新利村","十一组","于双全",2600,"丧失劳动动力","突发严重困难户"]
[176,"干召庙镇","红丰村","一组","岳文会",2600,"弱劳动力或半劳动力","边缘易致贫户"]
[177,"干召庙镇","民主村","十六组","刘建林",2600,"无劳动力","边缘易致贫户"]
[178,"干召庙镇","民主村","十六组","孙秀云",2600,"无劳动力","边缘易致贫户"]
[179,"干召庙镇","民主村","十二组","丁龙",2600,"丧失劳动动力","脱贫户"]
[180,"干召庙镇","永华村","三组","刘海娥",2600,"丧失劳动动力","突发严重困难户"]
[181,"干召庙镇","建华村","八组","杨银锁",2600,"无劳动力","脱贫户"]
[182,"干召庙镇","建华村","五组","郭树清",2600,"无劳动力","脱贫户"]
[183,"干召庙镇","新华村","三组","闫林",2600,"无劳动力","脱贫户"]
[184,"干召庙镇","广联村","四组","魏文海",2600,"无劳动力","突发严重困难户"]
[185,"干召庙镇","广联村","四组","李开萍",2600,"无劳动力","突发严重困难户"]
[186,"干召庙镇","广联村","二组","郝占龙",2600,"弱半劳动力","突发严重困难户"]
[187,"干召庙镇","广联村","二组","王秀兰",2600,"无劳动力","突发严重困难户"]
[188,"干召庙镇","黄济村","三组","康贵明",2600,"无劳动力","突发严重困难户"]
[189,"干召庙镇","脑高村","五组","孙玉珍",2600,"无劳动能力","边缘易致贫户"]
[190,"干召庙镇","农光村","四组","李树新",2600,"无劳动力","脱贫户"]
[191,"干召庙镇","农光村","四组","任桂兰",2600,"无劳动力","脱贫户"]
[192,"干召庙镇","棋盘村","六组","薛厚云",2600,"半劳动力或弱劳动力","脱贫户"]
[193,"干召庙镇","棋盘村","六组","李满枝",2600,"无劳动力","脱贫户"]
[194,"干召庙镇","棋盘村","三组","张尽忠",2600,"半劳动力或弱劳动力","脱贫户"]
[195,"干召庙镇","新丰村","二组","董关心",2600,"丧失劳动力","边缘易致贫户"]
[196,"干召庙镇","胜丰村","二组","吕秀兰",2600,"无劳动力","边缘易致贫户"]
[197,"干召庙镇","胜丰村","七组","刘秀珍",2600,"无劳动力","边缘易致贫户"]
[198,"干召庙镇","胜丰村","八组","武凤英",2600,"无劳动力","边缘易致贫户"]
[199,"干召庙镇","胜丰村","六组","张四女",2600,"无劳动力","边缘易致贫户"]
[200,"干召庙镇","胜丰村","一组","杨贵忠",2600,"弱劳动力或半劳动力","脱贫户"]
[201,"干召庙镇","隆丰村","九组","王建英",2600,"弱劳动力或半劳动力","边缘易致贫户"]
[202,"干召庙镇","隆丰村","五组","刘有花",2600,"无劳动力","脱贫户"]
[203,"干召庙镇","立新村","二组","杨树森",2600,"无劳动力","突发严重困难户"]
[204,"干召庙镇","立新村","二组","袁凤兰",2600,"无劳动力","突发严重困难户"]
[205,"干召庙镇","立新村","五组","赵林义",2600,"弱劳动力或半劳动力","脱贫户"]
[206,"干召庙镇","立新村","五组","张淑芳",2600,"无劳动力","脱贫户"]
[207,"干召庙镇","广丰村","一组","于洁",2600,"无劳动力","边缘易致贫户"]
[208,"干召庙镇","广丰村","六组","沈玉花",2600,"弱劳动力或半劳动力","脱贫户"]
[209,"干召庙镇","广丰村","五组","杨秀花",2600,"弱劳动力或半劳动力","脱贫户"]
[210,"干召庙镇","广丰村","四组","代恒盛",2600,"弱劳动力或半劳动力","脱贫户"]
[211,"干召庙镇","广丰村","四组","李记",2600,"无劳动力","脱贫户"]
[212,"干召庙镇","迎丰村","六组","刘兰英",2600,"无劳动力","边缘易致贫户"]
[213,"干召庙镇","建民村","三组","闫有才",2600,"无劳动力","边缘易致贫户"]
[214,"干召庙镇","建民村","十二组","李华",2600,"无劳动力","脱贫户"]
[215,"干召庙镇","建民村","七组","吴振刚",2600,"弱劳动力或半劳动力","脱贫户"]
[216,"干召庙镇","东风村","七组","李秀兰",2600,"无劳动力","突发严重困难户"]
[217,"干召庙镇","东风村","十组","仲玉兰",2600,"无劳动力","边缘易致贫户"]
[218,"干召庙镇","东风村","九组","赵禄海",2600,"无劳动力","脱贫户"]
[219,"干召庙镇","东风村","九组","张猫女",2600,"无劳动力","脱贫户"]
[220,"干召庙镇","东风村","六组","马丽",2600,"无劳动力","脱贫户"]
[221,"干召庙镇","东风村","五组","田保荣",2600,"弱劳动力或半劳动力","脱贫户"]
[222,"干召庙镇","东风村","三组","冯八女",2600,"无劳动力","脱贫户"]
[223,"干召庙镇","旭光村","二组","魏素英",2600,"丧失劳动力","突发严重困难户"]
[224,"干召庙镇","旭光村","二组","席竹叶",2600,"丧失劳动力","突发严重困难户"]
[225,"干召庙镇","新建村","七组","魏国华",2600,"丧失劳动力","突发严重困难户"]
[226,"干召庙镇","新建村","七组","张桂琴",2600,"弱劳动力或半劳动力","突发严重困难户"]
[227,"干召庙镇","立新村","立新村二组","丁三娃",2600,"无劳动力","边缘易致贫户"]
[228,"干召庙镇","立新村","立新村二组","田栓巧",2600,"无劳动力","边缘易致贫户"]
[229,"干召庙镇","旭光村","旭光村六组","李满仓",2600,"无劳动力","脱贫户"]
[230,"干召庙镇","旭光村","旭光村十三组","国秀梅",2600,"无劳动力","脱贫户"]
[231,"干召庙镇","旭光村","旭光村十三组","田东",2600,"丧失劳动力","脱贫户"]
[232,"干召庙镇","建华村","建华村七组","王业鸣",2600,"弱劳动力或半劳动力","脱贫户"]
[233,"干召庙镇","立新村","立新村七组","王 强",2600,"弱劳动力或半劳动力","突发严重困难户"]
[234,"干召庙镇","乌兰村","乌兰村四组","张业龙",2600,"弱劳动力或半劳动力","突发严重困难户"]
[235,"干召庙镇","农光村","六组","黄海元",2600,"丧失劳动力","突发严重困难户"]
[236,"干召庙镇","黄羊村","六组","苏丽君",2600,"丧失劳动力","突发严重困难户"]
[237,"干召庙镇","广丰村","五组","王飞",2600,"丧失劳动力","突发严重困难户"]
[238,"干召庙镇","广丰村","五组","关玉霞",2600,"弱劳动力或半劳动力","突发严重困难户"]
[239,"干召庙镇","建民村","九组","韩宽润",2600,"无劳动力","突发严重困难户"]
[240,"干召庙镇","建民村","九组","张翠花",2600,"无劳动力","突发严重困难户"]
[241,"干召庙镇","东风村\n","十一组\n","张树珍",2600,"无劳动力","突发严重困难户"]
[242,"狼山农场","四分场","四分场","冯启来",2600,"无劳动力","脱贫户"]
[243,"狼山农场","七分场","七分场","张家豪",2600,"无劳动力","脱贫户"]
[244,"狼山农场","十一分场","十一分场","孙文元",2600,"弱劳动力或半劳动力","脱贫户"]
[245,"狼山农场","十一分场","十一分场","杨宝小",2600,"无劳动力","脱贫户"]
[246,"狼山镇","红光村","五组","陈桂梅",2600,"无劳动力","脱贫户"]
[247,"狼山镇","西乐村","六组","杨连小",2600,"弱劳动力或半劳动力","脱贫户"]
[248,"狼山镇","永丰村","五组","杨翻身",2600,"弱劳动力或半劳动力","脱贫户"]
[249,"狼山镇","富强村","四组","马秀兰",2600,"弱劳动力或半劳动力","脱贫户"]
[250,"狼山镇","光明村","二组","陈冠玲",2600,"无劳动力","脱贫户"]
[251,"狼山镇","光明村","四组","王志荣",2600,"弱劳动力或半劳动力","脱贫户"]
[252,"狼山镇","光明村","六组","吴二旦",2600,"弱劳动力或半劳动力","脱贫户"]
[253,"狼山镇","迎丰村","三组","刘果叶",2600,"无劳动力","脱贫户"]
[254,"狼山镇","富强村","七组","温留洋",2600,"丧失劳动力","脱贫户"]
[255,"狼山镇","红光村","十一组","张小红",2600,"弱劳动力或半劳动力","脱贫户"]
[256,"狼山镇","爱丰村","三组","石玉珍",2600,"弱劳动力或半劳动力","脱贫户"]
[257,"狼山镇","永丰村","二组","秦润女",2600,"弱劳动力或半劳动力","脱贫户"]
[258,"狼山镇","永昌村","七组","赵五云",2600,"无劳动力","脱贫户"]
[259,"狼山镇","红光村","三组","秦玉彩",2600,"弱劳动力或半劳动力","脱贫户"]
[260,"狼山镇","幸福村","十一组","王根兰",2600,"无劳动力","脱贫户"]
[261,"狼山镇","新民村","二组","赵福生",2600,"弱劳动力或半劳动力","脱贫户"]
[262,"狼山镇","富强村","一组","付忠祥",2600,"弱劳动力或半劳动力","脱贫户"]
[263,"狼山镇","迎胜村","三组","宋德茂",2600,"无劳动力","脱贫户"]
[264,"狼山镇","迎胜村","三组","赵永娥",2600,"无劳动力","脱贫户"]
[265,"狼山镇","巴音村","六组","王三毛",2600,"弱劳动力或半劳动力","脱贫户"]
[266,"狼山镇","红光村","五组","邓二元",2600,"无劳动力","脱贫户"]
[267,"狼山镇","红光村","五组","潘小兰",2600,"无劳动力","脱贫户"]
[268,"狼山镇","巴音村","二组","何白女",2600,"无劳动力","突发严重困难户"]
[269,"狼山镇","永长村","三、七组","陈兰存",2600,"无劳动力","边缘易致贫户"]
[270,"狼山镇","迎胜村","二、三组","刘三旦",2600,"无劳动力","边缘易致贫户"]
[271,"狼山镇","红光村","一组","孙建国",2600,"无劳动力","边缘易致贫户"]
[272,"狼山镇","红光村","一组","何兰芳",2600,"无劳动力","边缘易致贫户"]
[273,"狼山镇","红光村","十一组","李国华",2600,"无劳动力","边缘易致贫户"]
[274,"狼山镇","红光村","十一组","张秀珍",2600,"弱劳动力或半劳动力","边缘易致贫户"]
[275,"狼山镇","红光村","一社","邬建国",2600,"无劳动力","边缘易致贫户"]
[276,"狼山镇","红光村","一社","霍翠花",2600,"无劳动力","边缘易致贫户"]
[277,"狼山镇","永乐村\n","一、七组","王志财",2600,"无劳动力","边缘易致贫户"]
[278,"狼山镇","永丰村","一组","王白",2600,"弱劳动力或半劳动力","脱贫户"]
[279,"狼山镇","永丰村","五组","王建荣",2600,"无劳动力","边缘易致贫户"]
[280,"狼山镇","爱丰村","三组","李秀英",2600,"弱劳动力或半劳动力","脱贫户"]
[281,"狼山镇","红光村","九组","邬喜梅",2600,"无劳动力","脱贫户"]
[282,"狼山镇","永丰村","四组","林枝山",2600,"弱劳动力或半劳动力","突发严重困难户"]
[283,"狼山镇","先锋村","二组","刘玉连",2600,"丧失劳动力","脱贫户"]
[284,"狼山镇","迎丰村","二组","刘保国",2600,"无劳动力","脱贫户"]
[285,"狼山镇","永丰村","二组","田喜春",2600,"无劳动力","脱贫户"]
[286,"狼山镇","幸福村","五、十一组","戴花眼",2600,"无劳动力","脱贫户"]
[287,"狼山镇","幸福村","二组","赵二玲",2600,"弱劳动力或半劳动力","脱贫户"]
[288,"狼山镇","爱丰村","五组","赵正英",2600,"弱劳动力或半劳动力","脱贫户"]
[289,"狼山镇","先锋村","六组","王树林",2600,"无劳动力","脱贫户"]
[290,"狼山镇","幸福村","一组","杨柱",2600,"无劳动力","脱贫户"]
[291,"狼山镇","西乐村","三组","张恒英",2600,"弱劳动力或半劳动力","脱贫户"]
[292,"狼山镇","先锋村","一组","谢灵枝",2600,"弱劳动力或半劳动力","突发严重困难户"]
[293,"狼山镇","永增村","一组","李建华",2600,"弱劳动力或半劳动力","边缘易致贫户"]
[294,"狼山镇","永增村","一组","刘翠秀",2600,"弱劳动力或半劳动力","边缘易致贫户"]
[295,"狼山镇","爱丰村","三组","朱永兰",2600,"无劳动力","脱贫户"]
[296,"狼山镇","永乐村\n","四组","孙福忠",2600,"弱劳动力或半劳动力","脱贫户"]
[297,"狼山镇","富强村","二、八组","陈桂连",2600,"弱劳动力或半劳动力","突发严重困难户"]
[298,"临农农牧业发展有限公司","三分场","三分场","吴凤莲",2600,"弱劳动力或半劳动力","脱贫户"]
[299,"临农农牧业发展有限公司","四分场","四分场","兰明和",2600,"无劳动力","脱贫户"]
[300,"临农农牧业发展有限公司","四分场","四分场","刘喜娃",2600,"无劳动力","脱贫户"]
[301,"临农农牧业发展有限公司","四分场","四分场","杨四白",2600,"无劳动力","边缘易致贫户"]
[302,"临农农牧业发展有限公司","五分场","五分场","王金娥",2600,"丧失劳动力","脱贫户"]
[303,"临农农牧业发展有限公司","五分场","五分场","李桂兰",2600,"弱劳动力或半劳动力","脱贫户"]
[304,"临农农牧业发展有限公司","七分场","七分场","史淑魁",2600,"弱劳动力或半劳动力","脱贫户"]
[305,"临农农牧业发展有限公司","八分场","八分场","温志武",2600,"丧失劳动力","脱贫户"]
[306,"临农农牧业发展有限公司","八分场","八分场","王海明",2600,"无劳动力","边缘易致贫户"]
[307,"临农农牧业发展有限公司","九分场","九分场","蒲恒光",2600,"无劳动力","脱贫户"]
[308,"临农农牧业发展有限公司","九分场","九分场","王秀群",2600,"无劳动力","脱贫户"]
[309,"临农农牧业发展有限公司","九分场","九分场","刘满元",2600,"无劳动力","脱贫户"]
[310,"临农农牧业发展有限公司","九分场","九分场","王桃",2600,"无劳动力","脱贫户"]
[311,"临农农牧业发展有限公司","十分场","十分场","周俊萍",2600,"丧失劳动力","脱贫户"]
[312,"临农农牧业发展有限公司","十分场","十分场","赵昶钦",2600,"无劳动力","脱贫户"]
[313,"临农农牧业发展有限公司","十分场","十分场","金付仓",2600,"无劳动力","脱贫户"]
[314,"临农农牧业发展有限公司","十分场","十分场","刘谋英",2600,"无劳动力","边缘易致贫户"]
[315,"临农农牧业发展有限公司","十分场","十分场","王候富",2600,"无劳动力","边缘易致贫户"]
[316,"临农农牧业发展有限公司","十一分场","十一分场","付德忠",2600,"弱劳动力或半劳动力","脱贫户"]
[317,"临农农牧业发展有限公司","十一分场","十一分场","王蛇女",2600,"无劳动力","脱贫户"]
[318,"临农农牧业发展有限公司","十一分场","十一分场","刘治国",2600,"弱劳动力或半劳动力","脱贫户"]
[319,"临农农牧业发展有限公司","十一分场","十一分场","李桂花",2600,"弱劳动力或半劳动力","脱贫户"]
[320,"临农农牧业发展有限公司","十一分场","十一分场","董占富",2600,"弱劳动力或半劳动力","脱贫户"]
[321,"临农农牧业发展有限公司","十一分场","十一分场","赵芹礼",2600,"无劳动力","脱贫户"]
[322,"临农农牧业发展有限公司","十一分场","十一分场","王义莲",2600,"弱劳动力或半劳动力","脱贫户"]
[323,"临农农牧业发展有限公司","十一分场","十一分场","张桂兰",2600,"无劳动力","脱贫户"]
[324,"曙光乡","治丰村","六组","张永华",2600,"无劳动力","脱贫户"]
[325,"曙光乡","治丰村","一组","韩红智",2600,"弱劳动力或半劳动力","突发严重困难户"]
[326,"曙光乡","治丰村","一组","韩登翔",2600,"无劳动力","突发严重困难户"]
[327,"曙光乡","治丰村","三组","王交其",2600,"无劳动力","边缘易致贫户"]
[328,"曙光乡","治丰村","三组","姜彩霞",2600,"弱劳动力或半劳动力","边缘易致贫户"]
[329,"曙光乡","治丰村","三组","王强",2600,"弱劳动力或半劳动力","突发严重困难户"]
[330,"曙光乡","治丰村","三组","王梓瑞",2600,"无劳动力","突发严重困难户"]
[331,"曙光乡","治丰村","三组","王永光",2600,"弱劳动力或半劳动力","突发严重困难户"]
[332,"曙光乡","治丰村","四组","张翠英",2600,"弱劳动力或半劳动力","边缘易致贫户"]
[333,"曙光乡","治丰村","五组","闫玉花",2600,"无劳动力","突发严重困难户"]
[334,"曙光乡","治安村","一组","代三高",2600,"无劳动力","突发严重困难户"]
[335,"曙光乡","治安村","一组","周桂英",2600,"弱劳动力或半劳动力","突发严重困难户"]
[336,"曙光乡","治安村","四组","杨玉宝",2600,"无劳动力","突发严重困难户"]
[337,"曙光乡","治安村","四组","杨丽",2600,"弱劳动力或半劳动力","突发严重困难户"]
[338,"曙光乡","治安村","四组","周娜",2600,"无劳动力","突发严重困难户"]
[339,"曙光乡","治安村","四组","陈玉喜",2600,"弱劳动力或半劳动力","突发严重困难户"]
[340,"曙光乡","治安村","四组","温海忠",2600,"无劳动力","突发严重困难户"]
[341,"曙光乡","治安村","四组","杨秀玲",2600,"弱劳动力或半劳动力","突发严重困难户"]
[342,"曙光乡","治安村","六组","康锁锁",2600,"丧失劳动力","突发严重困难户"]
[343,"曙光乡","治安村","六组","薛旦梅",2600,"弱劳动力或半劳动力","突发严重困难户"]
[344,"曙光乡","晨光村","三组","何忠福",2600,"无劳动力","突发严重困难户"]
[345,"曙光乡","晨光村","三组","李小莉",2600,"丧失劳动力","边缘易致贫户"]
[346,"曙光乡","晨光村","三组","张砺峰",2600,"无劳动力","边缘易致贫户"]
[347,"曙光乡","晨光村","四组","王利苹",2600,"弱劳动力或半劳动力","边缘易致贫户"]
[348,"曙光乡","晨光村","四组","贾明",2600,"弱劳动力或半劳动力","边缘易致贫户"]
[349,"曙光乡","宏胜村","一组","崔保良",2600,"无劳动力","边缘易致贫户"]
[350,"曙光乡","宏胜村","一组","胡桂英",2600,"无劳动力","边缘易致贫户"]
[351,"曙光乡","宏胜村","三组","史秀琴",2600,"弱劳动力或半劳动力","边缘易致贫户"]
[352,"曙光乡","庆丰村","三组","祝恒",2600,"丧失劳动力","边缘易致贫户"]
[353,"曙光乡","曙光村","四组","秦伟",2600,"弱劳动力或半劳动力","边缘易致贫户"]
[354,"曙光乡","曙光村","四组","秦子天",2600,"无劳动力","边缘易致贫户"]
[355,"曙光乡","曙光村","四组","秦子航",2600,"无劳动力","边缘易致贫户"]
[356,"曙光乡","曙光村","四组","秦子昱",2600,"无劳动力","边缘易致贫户"]
[357,"曙光乡","曙光村","一组","任四女",2600,"无劳动力","突发严重困难户"]
[358,"曙光乡","增丰村","六组","刘志怀",2600,"无劳动力","边缘易致贫户"]
[359,"曙光乡","增丰村","六组","李秀梅",2600,"弱劳动力或半劳动力","边缘易致贫户"]
[360,"曙光乡","增丰村","七组","淡向东",2600,"丧失劳动力","边缘易致贫户"]
[361,"曙光乡","增丰村","六组","刘秋娥",2600,"无劳动力","边缘易致贫户"]
[362,"曙光乡","增丰村","六组","许作梅",2600,"弱劳动力或半劳动力","边缘易致贫户"]
[363,"曙光乡","增丰村","六组","许作林",2600,"弱劳动力或半劳动力","边缘易致贫户"]
[364,"曙光乡","增丰村","二组","王改云",2600,"丧失劳动力","突发严重困难户"]
[365,"曙光乡","增丰村","二组","贺鸿伟",2600,"无劳动力","突发严重困难户"]
[366,"双河镇","土默地村","一组","梁紫玉",2600,"无劳动力","边缘易致贫户"]
[367,"双河镇","土默地村","二组","赵振国",2600,"丧失劳动力","边缘易致贫户"]
[368,"双河镇","土默地村","一组","李凤琴",2600,"无劳动力","边缘易致贫户"]
[369,"双河镇","土默地村","一组","于喜来",2600,"无劳动力","边缘易致贫户"]
[370,"双河镇","团结村","二组","杨丽 ",2600,"丧失劳动力","边缘易致贫户"]
[371,"双河镇","马场地村","一组","张乃小",2600,"无劳动力","边缘易致贫户"]
[372,"双河镇","马场地村","一组","赵桂英",2600,"无劳动力","边缘易致贫户"]
[373,"双河镇","丰河村","四组","王满平",2600,"无劳动力","突发严重困难户"]
[374,"双河镇","丰河村","四组","段永贵",2600,"无劳动力","突发严重困难户"]
[375,"双河镇","丰河村","四组","高俊海",2600,"无劳动力","突发严重困难户"]
[376,"双河镇","丰河村","四组","高果英",2600,"无劳动力","突发严重困难户"]
[377,"双河镇","丰河村","四组","孟长林",2600,"无劳动力","突发严重困难户"]
[378,"双河镇","丰河村","四组","邬秀英",2600,"无劳动力","突发严重困难户"]
[379,"双河镇","丰河村","四组","乔玉宣",2600,"无劳动力","突发严重困难户"]
[380,"双河镇","丰河村","四组","刘玉兰",2600,"无劳动力","突发严重困难户"]
[381,"双河镇","丰河村","四组","付贵英",2600,"无劳动力","突发严重困难户"]
[382,"双河镇","进步村","六组","武云世",2600,"无劳动力","突发严重困难户"]
[383,"双河镇","进步村","六组","郑秀梅",2600,"无劳动力","突发严重困难户"]
[384,"双河镇","富河村","五组","王孝荣",2600,"无劳动力","边缘易致贫户"]
[385,"双河镇","富河村","五组","黄芳兰",2600,"无劳动力","边缘易致贫户"]
[386,"双河镇","黄河村","六组","郝成柱",2600,"无劳动力","突发严重困难户"]
[387,"双河镇","黄河村","六组","高翠连",2600,"无劳动力","突发严重困难户"]
[388,"双河镇","黄河村","六组","郭巧玲",2600,"丧失劳动力","突发严重困难户"]
[389,"双河镇","黄河村","六组","张秀英",2600,"无劳动力","突发严重困难户"]
[390,"双河镇","黄河村","六组","郭文学",2600,"无劳动力","突发严重困难户"]
[391,"双河镇","新河村","二组","李学锋",2600,"丧失劳动力","突发严重困难户"]
[392,"双河镇","新河村","二组","王兰花",2600,"弱劳动力或半劳动力","突发严重困难户"]
[393,"双河镇","新荣村","三组","刘香瑞",2600,"无劳动力","突发严重困难户"]
[394,"双河镇","奋斗村","五组","刘进财",2600,"弱劳动力或半劳动力","突发严重困难户"]
[395,"双河镇","跃进村","五组","杜玉英",2600,"无劳动力","突发严重困难户"]
[396,"双河镇","跃进村","五组","郭如田",2600,"无劳动力","突发严重困难户"]
[397,"双河镇","跃进村","五组","朱贺兰",2600,"无劳动力","突发严重困难户"]
[398,"双河镇","跃进村","五组","高步强",2600,"无劳动力","突发严重困难户"]
{"$rows_left_out":163}